screen-n
type: LexicalEntry
canonical form: screen
sense: 04159470-n
part of speech: noun

04159470-n
type: LexicalConcept
in scheme: en-word.net
definition: partition consisting of a decorative frame or panel that serves to divide a space
ili: i58556
lexfile: noun.artifact
part of speech: noun
hypernym: 03900076-n