scale-n
type: LexicalEntry
canonical form: scale
sense: 04148903-n
part of speech: noun

04148903-n
type: LexicalConcept
in scheme: en-word.net
definition: an indicator having a graduated sequence of marks
ili: i58494
lexfile: noun.artifact
part of speech: noun
hypernym: 03573297-n