saucer-n
type: LexicalEntry
canonical form: saucer
sense: 04146374-n
part of speech: noun

04146374-n
type: LexicalConcept
in scheme: en-word.net
definition: a small shallow dish for holding a cup at the table
ili: i58474
lexfile: noun.artifact
part of speech: noun
hypernym: 03366791-n