safe-n
type: LexicalEntry
canonical form: safe
sense: 04132217-n
part of speech: noun

04132217-n
type: LexicalConcept
in scheme: en-word.net
definition: a ventilated or refrigerated cupboard for securing provisions from pests
ili: i58385
lexfile: noun.artifact
part of speech: noun
hypernym: 03152990-n