runway-n
type: LexicalEntry
canonical form: runway
sense: 04127936-n
part of speech: noun

04127936-n
type: LexicalConcept
in scheme: en-word.net
definition: a strip of level paved surface where planes can take off and land
ili: i58354
lexfile: noun.artifact
part of speech: noun
hypernym: 03906587-n