road-n
type: LexicalEntry
canonical form: road
sense: 04103160-n
part of speech: noun

route-n
type: LexicalEntry
canonical form: route
sense: 04103160-n
part of speech: noun

04103160-n
type: LexicalConcept
in scheme: en-word.net
definition: an open way (generally public) for travel or transportation
ili: i58206
lexfile: noun.artifact
part of speech: noun
hypernym: 04571984-n
mero part: 02832880-n
mero part: 03143632-n
mero part: 03586294-n
mero part: 04103827-n
mero part: 04214015-n
mero part: 04473168-n
mero part: 04506955-n
mero part: 04508161-n
mero substance: 03906828-n