retort-n
type: LexicalEntry
canonical form: retort
sense: 04090761-n
part of speech: noun

04090761-n
type: LexicalConcept
in scheme: en-word.net
definition: a vessel where substances are distilled or decomposed by heat
ili: i58125
lexfile: noun.artifact
part of speech: noun
hypernym: 04538393-n