restoration-n
type: LexicalEntry
canonical form: restoration
sense: 04090580-n
part of speech: noun

04090580-n
type: LexicalConcept
in scheme: en-word.net
definition: some artifact that has been restored or reconstructed
example: the restoration looked exactly like the original
ili: i58124
lexfile: noun.artifact
part of speech: noun
hypernym: 00022119-n