reservoir-n
type: LexicalEntry
canonical form: reservoir
sense: 04085686-n
part of speech: noun

04085686-n
type: LexicalConcept
in scheme: en-word.net
definition: tank used for collecting and storing a liquid (as water or oil)
ili: i58101
lexfile: noun.artifact
part of speech: noun
hypernym: 04395830-n