rendering-n
type: LexicalEntry
canonical form: rendering
sense: 04082827-n
part of speech: noun

04082827-n
type: LexicalConcept
in scheme: en-word.net
definition: a coat of stucco applied to a masonry wall
ili: i58085
lexfile: noun.artifact
part of speech: noun
hypernym: 03062092-n