rendering-n
type: LexicalEntry
canonical form: rendering
sense: 04082727-n
part of speech: noun

04082727-n
type: LexicalConcept
in scheme: en-word.net
definition: perspective drawing of an architect's design
ili: i58084
lexfile: noun.artifact
part of speech: noun
hypernym: 03239009-n