recording-n
type: LexicalEntry
canonical form: recording
sense: 04070980-n
part of speech: noun

04070980-n
type: LexicalConcept
in scheme: en-word.net
definition: a storage device on which information (sounds or images) have been recorded
ili: i58017
lexfile: noun.artifact
part of speech: noun
hypernym: 03750331-n