receptacle-n
type: LexicalEntry
canonical form: receptacle
sense: 04068016-n
part of speech: noun

04068016-n
type: LexicalConcept
in scheme: en-word.net
definition: a container that is used to put or keep things in
ili: i58004
lexfile: noun.artifact
part of speech: noun
hypernym: 03099154-n