radio-n
type: LexicalEntry
canonical form: radio
sense: 04048624-n
part of speech: noun

wireless-n
type: LexicalEntry
canonical form: wireless
sense: 04048624-n
part of speech: noun

04048624-n
type: LexicalConcept
in scheme: en-word.net
definition: a communication system based on broadcasting electromagnetic waves
ili: i57892
lexfile: noun.artifact
part of speech: noun
hypernym: 03082291-n
mero part: 04050813-n
mero part: 04052165-n