rack-n
type: LexicalEntry
canonical form: rack
sense: 04044916-n
part of speech: noun

stand-n
type: LexicalEntry
canonical form: stand
sense: 04044916-n
part of speech: noun

04044916-n
type: LexicalConcept
in scheme: en-word.net
definition: a support for displaying or holding various articles
example: the newspapers were arranged on a rack
ili: i57878
lexfile: noun.artifact
part of speech: noun
hypernym: 04366676-n
mero part: 04288108-n