print-n
type: LexicalEntry
canonical form: print
sense: 04010232-n
part of speech: noun

04010232-n
type: LexicalConcept
in scheme: en-word.net
definition: a fabric with a dyed pattern pressed onto it (usually by engraved rollers)
ili: i57675
lexfile: noun.artifact
part of speech: noun
hypernym: 03314753-n