pouch-n
type: LexicalEntry
canonical form: pouch
sense: 03999538-n
part of speech: noun

03999538-n
type: LexicalConcept
in scheme: en-word.net
definition: a small or medium size container for holding or carrying things
ili: i57612
lexfile: noun.artifact
part of speech: noun
hypernym: 02776042-n