pot-n
type: LexicalEntry
canonical form: pot
sense: 03997420-n
part of speech: noun

flowerpot-n
type: LexicalEntry
canonical form: flowerpot
sense: 03997420-n
part of speech: noun

03997420-n
type: LexicalConcept
in scheme: en-word.net
definition: a container in which plants are cultivated
ili: i57596
lexfile: noun.artifact
part of speech: noun
hypernym: 03099154-n