plug-n
type: LexicalEntry
canonical form: plug
sense: 03974625-n
part of speech: noun

male plug-n
type: LexicalEntry
canonical form: male plug
sense: 03974625-n
part of speech: noun

03974625-n
type: LexicalConcept
in scheme: en-word.net
definition: an electrical device with two or three pins that is inserted in a socket to make an electrical connection
ili: i57457
lexfile: noun.artifact
part of speech: noun
hypernym: 03274312-n