platter-n
type: LexicalEntry
canonical form: platter
sense: 03969492-n
part of speech: noun

03969492-n
type: LexicalConcept
in scheme: en-word.net
definition: a large shallow dish used for serving food
ili: i57436
lexfile: noun.artifact
part of speech: noun
hypernym: 03366791-n