platform-n
type: LexicalEntry
canonical form: platform
sense: 03968819-n
part of speech: noun

weapons platform-n
type: LexicalEntry
canonical form: weapons platform
sense: 03968819-n
part of speech: noun

03968819-n
type: LexicalConcept
in scheme: en-word.net
definition: any military structure or vehicle bearing weapons
ili: i57431
lexfile: noun.artifact
part of speech: noun
domain topic: 08215965-n
hypernym: 04348764-n