plaster-n
type: LexicalEntry
canonical form: plaster
sense: 03963861-n
part of speech: noun

plasterwork-n
type: LexicalEntry
canonical form: plasterwork
sense: 03963861-n
part of speech: noun

03963861-n
type: LexicalConcept
in scheme: en-word.net
definition: a surface of hardened plaster (as on a wall or ceiling)
example: there were cracks in the plaster
ili: i57401
lexfile: noun.artifact
part of speech: noun
hypernym: 04369112-n