overhead-n
type: LexicalEntry
canonical form: overhead
sense: 03870080-n
part of speech: noun

03870080-n
type: LexicalConcept
in scheme: en-word.net
definition: (nautical) the top surface of an enclosed space on a ship
ili: i56835
lexfile: noun.artifact
part of speech: noun
domain topic: 00315295-n
hypernym: 02993828-n