nine-spot-n
type: LexicalEntry
canonical form: nine-spot
sense: 03831088-n
part of speech: noun

nine-n
type: LexicalEntry
canonical form: nine
sense: 03831088-n
part of speech: noun

03831088-n
type: LexicalConcept
in scheme: en-word.net
definition: one of four playing cards in a deck with nine pips on the face
ili: i56605
lexfile: noun.artifact
part of speech: noun
hypernym: 04293445-n