net-n
type: LexicalEntry
canonical form: net
sense: 03825694-n
part of speech: noun

03825694-n
type: LexicalConcept
in scheme: en-word.net
definition: game equipment consisting of a strip of netting dividing the playing area in tennis or badminton
ili: i56570
lexfile: noun.artifact
part of speech: noun
hypernym: 03419072-n