national monument-n
type: LexicalEntry
canonical form: national monument
sense: 03816492-n
part of speech: noun

03816492-n
type: LexicalConcept
in scheme: en-word.net
definition: memorial consisting of a structure or natural landmark of historic interest; set aside by national government for preservation and public enjoyment
ili: i56516
lexfile: noun.artifact
part of speech: noun
hypernym: 03749393-n