muzzle-n
type: LexicalEntry
canonical form: muzzle
sense: 03808824-n
part of speech: noun

03808824-n
type: LexicalConcept
in scheme: en-word.net
definition: a leather or wire restraint that fits over an animal's snout (especially a dog's nose and jaws) and prevents it from eating or biting
ili: i56472
lexfile: noun.artifact
part of speech: noun
hypernym: 04088956-n