musical instrument-n
type: LexicalEntry
canonical form: musical instrument
sense: 03806455-n
part of speech: noun

instrument-n
type: LexicalEntry
canonical form: instrument
sense: 03806455-n
part of speech: noun

03806455-n
type: LexicalConcept
in scheme: en-word.net
definition: any of various devices or contrivances that can be used to produce musical tones or sounds
ili: i56458
lexfile: noun.artifact
part of speech: noun
hypernym: 03187746-n