motorcycle-n
type: LexicalEntry
canonical form: motorcycle
sense: 03796045-n
part of speech: noun

bike-n
type: LexicalEntry
canonical form: bike
sense: 03796045-n
part of speech: noun

03796045-n
type: LexicalConcept
in scheme: en-word.net
definition: a motor vehicle with two wheels and a strong frame
ili: i56397
lexfile: noun.artifact
part of speech: noun
hypernym: 03796768-n
mero part: 03621637-n
mero part: 03621972-n
mero part: 03802127-n