mooring-n
type: LexicalEntry
canonical form: mooring
sense: 03790008-n
part of speech: noun

mooring line-n
type: LexicalEntry
canonical form: mooring line
sense: 03790008-n
part of speech: noun

03790008-n
type: LexicalConcept
in scheme: en-word.net
definition: (nautical) a line that holds an object (especially a boat) in place
ili: i56359
lexfile: noun.artifact
part of speech: noun
domain topic: 02861626-n
hypernym: 03676175-n