minibar-n
type: LexicalEntry
canonical form: minibar
sense: 03775145-n
part of speech: noun

cellaret-n
type: LexicalEntry
canonical form: cellaret
sense: 03775145-n
part of speech: noun

03775145-n
type: LexicalConcept
in scheme: en-word.net
definition: sideboard with compartments for holding bottles
ili: i56269
lexfile: noun.artifact
part of speech: noun
hypernym: 02915411-n