miniature-n
type: LexicalEntry
canonical form: miniature
sense: 03774932-n
part of speech: noun

illumination-n
type: LexicalEntry
canonical form: illumination
sense: 03774932-n
part of speech: noun

03774932-n
type: LexicalConcept
in scheme: en-word.net
definition: painting or drawing included in a book (especially in illuminated medieval manuscripts)
ili: i56268
lexfile: noun.artifact
part of speech: noun
domain topic: 15284095-n
hypernym: 03882197-n