mess-n
type: LexicalEntry
canonical form: mess
sense: 03756556-n
part of speech: noun

mess hall-n
type: LexicalEntry
canonical form: mess hall
sense: 03756556-n
part of speech: noun

03756556-n
type: LexicalConcept
in scheme: en-word.net
definition: a (large) military dining room where service personnel eat or relax
ili: i56167
lexfile: noun.artifact
part of speech: noun
domain topic: 08215965-n
hypernym: 03205385-n
mero part: 07581023-n