map-n
type: LexicalEntry
canonical form: map
sense: 03725654-n
part of speech: noun

03725654-n
type: LexicalConcept
in scheme: en-word.net
definition: a diagrammatic representation of the earth's surface (or part of it)
ili: i56008
lexfile: noun.artifact
part of speech: noun
hypernym: 04083958-n