machine-n
type: LexicalEntry
canonical form: machine
sense: 03705309-n
part of speech: noun

03705309-n
type: LexicalConcept
in scheme: en-word.net
definition: any mechanical or electrical device that transmits or modifies energy to perform or assist in the performance of human tasks
ili: i55888
lexfile: noun.artifact
part of speech: noun
hypernym: 03187746-n