link-n
type: LexicalEntry
canonical form: link
sense: 03679596-n
part of speech: noun

data link-n
type: LexicalEntry
canonical form: data link
sense: 03679596-n
part of speech: noun

03679596-n
type: LexicalConcept
in scheme: en-word.net
definition: an interconnecting circuit between two or more locations for the purpose of transmitting and receiving data
ili: i55725
lexfile: noun.artifact
part of speech: noun
hypernym: 03037347-n