limb-n
type: LexicalEntry
canonical form: limb
sense: 03674420-n
part of speech: noun

03674420-n
type: LexicalConcept
in scheme: en-word.net
definition: either of the two halves of a bow from handle to tip
example: the upper limb of the bow
ili: i55698
lexfile: noun.artifact
part of speech: noun
hypernym: 03898588-n