launch-n
type: LexicalEntry
canonical form: launch
sense: 03652737-n
part of speech: noun

03652737-n
type: LexicalConcept
in scheme: en-word.net
definition: a motorboat with an open deck or a half deck
ili: i55569
lexfile: noun.artifact
part of speech: noun
hypernym: 03795763-n