lace-n
type: LexicalEntry
canonical form: lace
sense: 03636736-n
part of speech: noun

lacing-n
type: LexicalEntry
canonical form: lacing
sense: 03636736-n
part of speech: noun

03636736-n
type: LexicalConcept
in scheme: en-word.net
definition: a cord that is drawn through eyelets or around hooks in order to draw together two edges (as of a shoe or garment)
ili: i55468
lexfile: noun.artifact
part of speech: noun
hypernym: 03110761-n