knob-n
type: LexicalEntry
canonical form: knob
sense: 03631406-n
part of speech: noun

boss-n
type: LexicalEntry
canonical form: boss
sense: 03631406-n
part of speech: noun

03631406-n
type: LexicalConcept
in scheme: en-word.net
definition: a circular rounded projection or protuberance
ili: i55436
lexfile: noun.artifact
part of speech: noun
hypernym: 04015323-n