kit-n
type: LexicalEntry
canonical form: kit
sense: 03624605-n
part of speech: noun

outfit-n
type: LexicalEntry
canonical form: outfit
sense: 03624605-n
part of speech: noun

03624605-n
type: LexicalConcept
in scheme: en-word.net
definition: gear consisting of a set of articles or tools for a specified purpose
ili: i55394
lexfile: noun.artifact
part of speech: noun
hypernym: 03435869-n