jack-n
type: LexicalEntry
canonical form: jack
sense: 03594280-n
part of speech: noun

knave-n
type: LexicalEntry
canonical form: knave
sense: 03594280-n
part of speech: noun

03594280-n
type: LexicalConcept
in scheme: en-word.net
definition: one of four face cards in a deck bearing a picture of a young prince
ili: i55208
lexfile: noun.artifact
part of speech: noun
hypernym: 03318973-n