intake-n
type: LexicalEntry
canonical form: intake
sense: 03581786-n
part of speech: noun

inlet-n
type: LexicalEntry
canonical form: inlet
sense: 03581786-n
part of speech: noun

03581786-n
type: LexicalConcept
in scheme: en-word.net
definition: an opening through which fluid is admitted to a tube or container
ili: i55135
lexfile: noun.artifact
part of speech: noun
hypernym: 03854249-n