import-n
type: LexicalEntry
canonical form: import
sense: 03569847-n
part of speech: noun

importation-n
type: LexicalEntry
canonical form: importation
sense: 03569847-n
part of speech: noun

03569847-n
type: LexicalConcept
in scheme: en-word.net
definition: commodities (goods or services) bought from a foreign country
ili: i55069
lexfile: noun.artifact
part of speech: noun
hypernym: 03080712-n