illustration-n
type: LexicalEntry
canonical form: illustration
sense: 03566525-n
part of speech: noun

03566525-n
type: LexicalConcept
in scheme: en-word.net
definition: a visual representation (a picture or diagram) that is used to make some subject more pleasing or easier to understand
ili: i55053
lexfile: noun.artifact
part of speech: noun
hypernym: 04083958-n