horror-n
type: LexicalEntry
canonical form: horror
sense: 03543047-n
part of speech: noun

03543047-n
type: LexicalConcept
in scheme: en-word.net
definition: something that inspires horror; something horrible
example: the painting that others found so beautiful was a horror to him
ili: i54917
lexfile: noun.artifact
part of speech: noun
hypernym: 04431553-n