horizontal surface-n
type: LexicalEntry
canonical form: horizontal surface
sense: 03541528-n
part of speech: noun

level-n
type: LexicalEntry
canonical form: level
sense: 03541528-n
part of speech: noun

03541528-n
type: LexicalConcept
in scheme: en-word.net
definition: a flat surface at right angles to a plumb line
example: park the car on the level
ili: i54908
lexfile: noun.artifact
part of speech: noun
hypernym: 04369112-n