hoop-n
type: LexicalEntry
canonical form: hoop
sense: 03539609-n
part of speech: noun

03539609-n
type: LexicalConcept
in scheme: en-word.net
definition: a light curved skeleton to spread out a skirt
ili: i54894
lexfile: noun.artifact
part of speech: noun
hypernym: 04233599-n