hammer-n
type: LexicalEntry
canonical form: hammer
sense: 03486255-n
part of speech: noun

03486255-n
type: LexicalConcept
in scheme: en-word.net
definition: a hand tool with a heavy rigid head and a handle; used to deliver an impulsive force by striking
ili: i54582
lexfile: noun.artifact
part of speech: noun
hypernym: 03494245-n
mero part: 03487211-n
mero part: 03506758-n