hall-n
type: LexicalEntry
canonical form: hall
sense: 03483990-n
part of speech: noun

03483990-n
type: LexicalConcept
in scheme: en-word.net
definition: a large room for gatherings, receiving guests, or entertainment
example: lecture hall
example: pool hall
ili: i54569
lexfile: noun.artifact
part of speech: noun
hypernym: 04112987-n